Gradle bootRun failing? - spring-boot

I am having a very strange problem. I'm using Gradle to build a Java Spring application. When I bootRun my application, everything works fine; the service is up, I can call the endpoints, etc. However, when I stop my application in IntelliJ, I get the following error:
> Task :bootRun FAILED
FAILURE: Build failed with an exception.
* What went wrong:
Execution failed for task ':bootRun'.
> Process 'command 'C:\Program Files\Java\jdk1.8.0_172\bin\java.exe'' finished with non-zero exit value 1
* Try:
Run with --info or --debug option to get more log output. Run with --scan to get full insights.
* Exception is:
org.gradle.api.tasks.TaskExecutionException: Execution failed for task
':bootRun'.
at org.gradle.api.internal.tasks.execution.ExecuteActionsTaskExecuter.executeActions(ExecuteActionsTaskExecuter.java:110)
at org.gradle.api.internal.tasks.execution.ExecuteActionsTaskExecuter.execute(ExecuteActionsTaskExecuter.java:77)
at org.gradle.api.internal.tasks.execution.OutputDirectoryCreatingTaskExecuter.execute(OutputDirectoryCreatingTaskExecuter.java:51)
at org.gradle.api.internal.tasks.execution.SkipUpToDateTaskExecuter.execute(SkipUpToDateTaskExecuter.java:59)
at org.gradle.api.internal.tasks.execution.ResolveTaskOutputCachingStateExecuter.execute(ResolveTaskOutputCachingStateExecuter.java:54)
at org.gradle.api.internal.tasks.execution.ValidatingTaskExecuter.execute(ValidatingTaskExecuter.java:59)
at org.gradle.api.internal.tasks.execution.SkipEmptySourceFilesTaskExecuter.execute(SkipEmptySourceFilesTaskExecuter.java:101)
at org.gradle.api.internal.tasks.execution.FinalizeInputFilePropertiesTaskExecuter.execute(FinalizeInputFilePropertiesTaskExecuter.java:44)
at org.gradle.api.internal.tasks.execution.CleanupStaleOutputsExecuter.execute(CleanupStaleOutputsExecuter.java:91)
at org.gradle.api.internal.tasks.execution.ResolveTaskArtifactStateTaskExecuter.execute(ResolveTaskArtifactStateTaskExecuter.java:62)
at org.gradle.api.internal.tasks.execution.SkipTaskWithNoActionsExecuter.execute(SkipTaskWithNoActionsExecuter.java:59)
at org.gradle.api.internal.tasks.execution.SkipOnlyIfTaskExecuter.execute(SkipOnlyIfTaskExecuter.java:54)
at org.gradle.api.internal.tasks.execution.ExecuteAtMostOnceTaskExecuter.execute(ExecuteAtMostOnceTaskExecuter.java:43)
at org.gradle.api.internal.tasks.execution.CatchExceptionTaskExecuter.execute(CatchExceptionTaskExecuter.java:34)
at org.gradle.api.internal.tasks.execution.EventFiringTaskExecuter$1.run(EventFiringTaskExecuter.java:51)
at org.gradle.internal.operations.DefaultBuildOperationExecutor$RunnableBuildOperationWorker.execute(DefaultBuildOperationExecutor.java:317)
at org.gradle.internal.operations.DefaultBuildOperationExecutor$RunnableBuildOperationWorker.execute(DefaultBuildOperationExecutor.java:309)
at org.gradle.internal.operations.DefaultBuildOperationExecutor.execute(DefaultBuildOperationExecutor.java:185)
at org.gradle.internal.operations.DefaultBuildOperationExecutor.run(DefaultBuildOperationExecutor.java:97)
at org.gradle.internal.operations.DelegatingBuildOperationExecutor.run(DelegatingBuildOperationExecutor.java:31)
at org.gradle.api.internal.tasks.execution.EventFiringTaskExecuter.execute(EventFiringTaskExecuter.java:46)
at org.gradle.execution.taskgraph.DefaultTaskExecutionGraph$ExecuteTaskAction.execute(DefaultTaskExecutionGraph.java:262)
at org.gradle.execution.taskgraph.DefaultTaskExecutionGraph$ExecuteTaskAction.execute(DefaultTaskExecutionGraph.java:246)
at org.gradle.execution.taskgraph.DefaultTaskPlanExecutor$TaskExecutorWorker$1.execute(DefaultTaskPlanExecutor.java:136)
at org.gradle.execution.taskgraph.DefaultTaskPlanExecutor$TaskExecutorWorker$1.execute(DefaultTaskPlanExecutor.java:130)
at org.gradle.execution.taskgraph.DefaultTaskPlanExecutor$TaskExecutorWorker.execute(DefaultTaskPlanExecutor.java:201)
at org.gradle.execution.taskgraph.DefaultTaskPlanExecutor$TaskExecutorWorker.executeWithTask(DefaultTaskPlanExecutor.java:192)
at org.gradle.execution.taskgraph.DefaultTaskPlanExecutor$TaskExecutorWorker.run(DefaultTaskPlanExecutor.java:130)
at org.gradle.internal.concurrent.ExecutorPolicy$CatchAndRecordFailures.onExecute(ExecutorPolicy.java:63)
at org.gradle.internal.concurrent.ManagedExecutorImpl$1.run(ManagedExecutorImpl.java:46)
at org.gradle.internal.concurrent.ThreadFactoryImpl$ManagedThreadRunnable.run(ThreadFactoryImpl.java:55)
Caused by: org.gradle.process.internal.ExecException: Process 'command 'C:\Program Files\Java\jdk1.8.0_172\bin\java.exe'' finished with non-zero exit value 1
at org.gradle.process.internal.DefaultExecHandle$ExecResultImpl.assertNormalExitValue(DefaultExecHandle.java:395)
at org.gradle.process.internal.DefaultJavaExecAction.execute(DefaultJavaExecAction.java:37)
at org.gradle.api.tasks.JavaExec.exec(JavaExec.java:76)
at org.springframework.boot.gradle.tasks.run.BootRun.exec(BootRun.java:51)
at org.gradle.internal.reflect.JavaMethod.invoke(JavaMethod.java:73)
at org.gradle.api.internal.project.taskfactory.StandardTaskAction.doExecute(StandardTaskAction.java:46)
at org.gradle.api.internal.project.taskfactory.StandardTaskAction.execute(StandardTaskAction.java:39)
at org.gradle.api.internal.project.taskfactory.StandardTaskAction.execute(StandardTaskAction.java:26)
at org.gradle.api.internal.AbstractTask$TaskActionWrapper.execute(AbstractTask.java:794)
at org.gradle.api.internal.AbstractTask$TaskActionWrapper.execute(AbstractTask.java:761)
at org.gradle.api.internal.tasks.execution.ExecuteActionsTaskExecuter$1.run(ExecuteActionsTaskExecuter.java:131)
at org.gradle.internal.operations.DefaultBuildOperationExecutor$RunnableBuildOperationWorker.execute(DefaultBuildOperationExecutor.java:317)
at org.gradle.internal.operations.DefaultBuildOperationExecutor$RunnableBuildOperationWorker.execute(DefaultBuildOperationExecutor.java:309)
at org.gradle.internal.operations.DefaultBuildOperationExecutor.execute(DefaultBuildOperationExecutor.java:185)
at org.gradle.internal.operations.DefaultBuildOperationExecutor.run(DefaultBuildOperationExecutor.java:97)
at org.gradle.internal.operations.DelegatingBuildOperationExecutor.run(DelegatingBuildOperationExecutor.java:31)
at org.gradle.api.internal.tasks.execution.ExecuteActionsTaskExecuter.executeAction(ExecuteActionsTaskExecuter.java:120)
at org.gradle.api.internal.tasks.execution.ExecuteActionsTaskExecuter.executeActions(ExecuteActionsTaskExecuter.java:99)
... 30 more
* Get more help at https://help.gradle.org
BUILD FAILED in 18s
5 actionable tasks: 4 executed, 1 up-to-date
Process 'command 'C:\Program Files\Java\jdk1.8.0_172\bin\java.exe'' finished with non-zero exit value 1
9:27:55 AM: Tasks execution finished 'clean build bootRun --stacktrace --warning-mode=all'.
Nothing seems to be wrong with my application, so I'm wondering why I'm getting this error. Thanks.

There is a way to get more detailed error message.
You'd need a simple test class, which just initializes context. Like this:
package com.yourpackage.yourapp;
import org.junit.Test;
import org.junit.runner.RunWith;
import org.springframework.boot.test.context.SpringBootTest;
import org.springframework.test.context.junit4.SpringRunner;
#RunWith(SpringRunner.class)
#SpringBootTest
public class YourApplicationTest {
#Test
public void contextLoads() {
}
}
Clean up and build project again.
gradlew clean
gradlew build
build target will also run test and generate test report on failure.
Navigate to <your_project>/build/reports/tests/classes/com.yourpackage.yourapp.YourApplicationTest.html, click on failed test and see more detailed exception.
Hope that helps!

Related

Locally working build.gradle is failing in gitlab-ci runner

Locally
I run a docker container based on image adoptopenjdk:11-jdk
Inside my container, I run ./scripts/bash/run_plugin_tests.sh which contains just gradlew check
The build succeeds and tests are executed
On our Gitlab server
I am running a gitlab ci runner with a docker executor.
This is the .gitlab-ci.yml that is processed:
stages:
- test
- deploy
variables:
GRAILS_OPTS: -Xms512m -Xmx512m
DEPLOYMENT: CI
test_plugin:
image: adoptopenjdk:11-jdk
stage: test
script:
- ./scripts/bash/run_plugin_tests.sh
artifacts:
when: always
expire_in: 7d
reports:
junit:
- ./build/test-results/test/*.xml
paths:
- ./build/reports/tests/*
deploy_plugin:
image: adoptopenjdk:11-jdk
stage: deploy
script:
- ./scripts/bash/deploy_plugin.sh
dependencies:
- test_plugin
#Only on master branch
only:
- main
I see the runner initialize and launching the adoptopenjdk:11-jdk container, as specified in yml file:
Running with gitlab-runner 15.6.1 (133d7e76)
on EC2-Gitlab-runner(Instance : i-0b35b804ea5d8f6d7) zpxfwm-E
Preparing the "docker" executor 00:02
Using Docker executor with image adoptopenjdk:11-jdk ...
Pulling docker image adoptopenjdk:11-jdk ...
The build job with the following logs:
UPDATE 1: This was updated after the suggestion in the comments
to add an indication of what tests are being executed,
and adding the --stacktrace option.
$ ./scripts/bash/run_plugin_tests.sh
+ ./gradlew clean check --stacktrace
Downloading https://services.gradle.org/distributions/gradle-5.6.4-bin.zip
.........................................................................................
Welcome to Gradle 5.6.4!
Here are the highlights of this release:
- Incremental Groovy compilation
- Groovy compile avoidance
- Test fixtures for Java projects
- Manage plugin versions via settings script
For more details see https://docs.gradle.org/5.6.4/release-notes.html
Starting a Gradle Daemon (subsequent builds will be faster)
> Task :clean UP-TO-DATE
> Task :compileAstJava NO-SOURCE
> Task :compileAstGroovy NO-SOURCE
> Task :processAstResources NO-SOURCE
> Task :astClasses UP-TO-DATE
> Task :compileJava NO-SOURCE
> Task :configScript
> Task :compileGroovy
> Task :copyAstClasses NO-SOURCE
> Task :copyCommands NO-SOURCE
> Task :copyTemplates NO-SOURCE
> Task :processResources
> Task :classes
> Task :compileTestJava NO-SOURCE
> Task :compileTestGroovy
> Task :processTestResources NO-SOURCE
> Task :testClasses
> Task :test FAILED
Error: Could not find or load main class
Caused by: java.lang.ClassNotFoundException:
Error: Could not find or load main class
Caused by: java.lang.ClassNotFoundException:
Process 'Gradle Test Executor 3' finished with non-zero exit value 1
org.gradle.process.internal.ExecException: Process 'Gradle Test Executor 3' finished with non-zero exit value 1
at org.gradle.process.internal.DefaultExecHandle$ExecResultImpl.assertNormalExitValue(DefaultExecHandle.java:409)
at org.gradle.process.internal.worker.DefaultWorkerProcess.onProcessStop(DefaultWorkerProcess.java:141)
at org.gradle.process.internal.worker.DefaultWorkerProcess.access$000(DefaultWorkerProcess.java:42)
at org.gradle.process.internal.worker.DefaultWorkerProcess$1.executionFinished(DefaultWorkerProcess.java:94)
at java.base/jdk.internal.reflect.NativeMethodAccessorImpl.invoke0(Native Method)
at java.base/jdk.internal.reflect.NativeMethodAccessorImpl.invoke(NativeMethodAccessorImpl.java:62)
at java.base/jdk.internal.reflect.DelegatingMethodAccessorImpl.invoke(DelegatingMethodAccessorImpl.java:43)
at java.base/java.lang.reflect.Method.invoke(Method.java:566)
at org.gradle.internal.dispatch.ReflectionDispatch.dispatch(ReflectionDispatch.java:36)
at org.gradle.internal.dispatch.ReflectionDispatch.dispatch(ReflectionDispatch.java:24)
at org.gradle.internal.event.AbstractBroadcastDispatch.dispatch(AbstractBroadcastDispatch.java:42)
at org.gradle.internal.event.BroadcastDispatch$SingletonDispatch.dispatch(BroadcastDispatch.java:231)
at org.gradle.internal.event.BroadcastDispatch$SingletonDispatch.dispatch(BroadcastDispatch.java:150)
at org.gradle.internal.event.ListenerBroadcast.dispatch(ListenerBroadcast.java:141)
at org.gradle.internal.event.ListenerBroadcast.dispatch(ListenerBroadcast.java:37)
at org.gradle.internal.dispatch.ProxyDispatchAdapter$DispatchingInvocationHandler.invoke(ProxyDispatchAdapter.java:94)
at com.sun.proxy.$Proxy72.executionFinished(Unknown Source)
at org.gradle.process.internal.DefaultExecHandle.setEndStateInfo(DefaultExecHandle.java:217)
at org.gradle.process.internal.DefaultExecHandle.finished(DefaultExecHandle.java:349)
at org.gradle.process.internal.ExecHandleRunner.completed(ExecHandleRunner.java:110)
at org.gradle.process.internal.ExecHandleRunner.run(ExecHandleRunner.java:84)
at org.gradle.internal.operations.CurrentBuildOperationPreservingRunnable.run(CurrentBuildOperationPreservingRunnable.java:42)
at org.gradle.internal.concurrent.ExecutorPolicy$CatchAndRecordFailures.onExecute(ExecutorPolicy.java:64)
at org.gradle.internal.concurrent.ManagedExecutorImpl$1.run(ManagedExecutorImpl.java:48)
at java.base/java.util.concurrent.ThreadPoolExecutor.runWorker(ThreadPoolExecutor.java:1128)
at java.base/java.util.concurrent.ThreadPoolExecutor$Worker.run(ThreadPoolExecutor.java:628)
at org.gradle.internal.concurrent.ThreadFactoryImpl$ManagedThreadRunnable.run(ThreadFactoryImpl.java:56)
at java.base/java.lang.Thread.run(Thread.java:829)
Error: Could not find or load main class
Caused by: java.lang.ClassNotFoundException:
Process 'Gradle Test Executor 4' finished with non-zero exit value 1
org.gradle.process.internal.ExecException: Process 'Gradle Test Executor 4' finished with non-zero exit value 1
at org.gradle.process.internal.DefaultExecHandle$ExecResultImpl.assertNormalExitValue(DefaultExecHandle.java:409)
at org.gradle.process.internal.worker.DefaultWorkerProcess.onProcessStop(DefaultWorkerProcess.java:141)
at org.gradle.process.internal.worker.DefaultWorkerProcess.access$000(DefaultWorkerProcess.java:42)
at org.gradle.process.internal.worker.DefaultWorkerProcess$1.executionFinished(DefaultWorkerProcess.java:94)
at java.base/jdk.internal.reflect.NativeMethodAccessorImpl.invoke0(Native Method)
at java.base/jdk.internal.reflect.NativeMethodAccessorImpl.invoke(NativeMethodAccessorImpl.java:62)
at java.base/jdk.internal.reflect.DelegatingMethodAccessorImpl.invoke(DelegatingMethodAccessorImpl.java:43)
at java.base/java.lang.reflect.Method.invoke(Method.java:566)
at org.gradle.internal.dispatch.ReflectionDispatch.dispatch(ReflectionDispatch.java:36)
at org.gradle.internal.dispatch.ReflectionDispatch.dispatch(ReflectionDispatch.java:24)
at org.gradle.internal.event.AbstractBroadcastDispatch.dispatch(AbstractBroadcastDispatch.java:42)
at org.gradle.internal.event.BroadcastDispatch$SingletonDispatch.dispatch(BroadcastDispatch.java:231)
at org.gradle.internal.event.BroadcastDispatch$SingletonDispatch.dispatch(BroadcastDispatch.java:150)
at org.gradle.internal.event.ListenerBroadcast.dispatch(ListenerBroadcast.java:141)
at org.gradle.internal.event.ListenerBroadcast.dispatch(ListenerBroadcast.java:37)
at org.gradle.internal.dispatch.ProxyDispatchAdapter$DispatchingInvocationHandler.invoke(ProxyDispatchAdapter.java:94)
at com.sun.proxy.$Proxy72.executionFinished(Unknown Source)
at org.gradle.process.internal.DefaultExecHandle.setEndStateInfo(DefaultExecHandle.java:217)
at org.gradle.process.internal.DefaultExecHandle.finished(DefaultExecHandle.java:349)
at org.gradle.process.internal.ExecHandleRunner.completed(ExecHandleRunner.java:110)
at org.gradle.process.internal.ExecHandleRunner.run(ExecHandleRunner.java:84)
at org.gradle.internal.operations.CurrentBuildOperationPreservingRunnable.run(CurrentBuildOperationPreservingRunnable.java:42)
at org.gradle.internal.concurrent.ExecutorPolicy$CatchAndRecordFailures.onExecute(ExecutorPolicy.java:64)
at org.gradle.internal.concurrent.ManagedExecutorImpl$1.run(ManagedExecutorImpl.java:48)
at java.base/java.util.concurrent.ThreadPoolExecutor.runWorker(ThreadPoolExecutor.java:1128)
at java.base/java.util.concurrent.ThreadPoolExecutor$Worker.run(ThreadPoolExecutor.java:628)
at org.gradle.internal.concurrent.ThreadFactoryImpl$ManagedThreadRunnable.run(ThreadFactoryImpl.java:56)
at java.base/java.lang.Thread.run(Thread.java:829)
FAILURE: Build failed with an exception.
* What went wrong:
Execution failed for task ':test'.
> Process 'Gradle Test Executor 2' finished with non-zero exit value 1
* Try:
Run with --info or --debug option to get more log output. Run with --scan to get full insights.
* Exception is:
org.gradle.api.tasks.TaskExecutionException: Execution failed for task ':test'.
at org.gradle.api.internal.tasks.execution.ExecuteActionsTaskExecuter$3.accept(ExecuteActionsTaskExecuter.java:166)
at org.gradle.api.internal.tasks.execution.ExecuteActionsTaskExecuter$3.accept(ExecuteActionsTaskExecuter.java:163)
at org.gradle.internal.Try$Failure.ifSuccessfulOrElse(Try.java:191)
at org.gradle.api.internal.tasks.execution.ExecuteActionsTaskExecuter.execute(ExecuteActionsTaskExecuter.java:156)
at org.gradle.api.internal.tasks.execution.ValidatingTaskExecuter.execute(ValidatingTaskExecuter.java:62)
at org.gradle.api.internal.tasks.execution.SkipEmptySourceFilesTaskExecuter.execute(SkipEmptySourceFilesTaskExecuter.java:108)
at org.gradle.api.internal.tasks.execution.ResolveBeforeExecutionOutputsTaskExecuter.execute(ResolveBeforeExecutionOutputsTaskExecuter.java:67)
at org.gradle.api.internal.tasks.execution.ResolveAfterPreviousExecutionStateTaskExecuter.execute(ResolveAfterPreviousExecutionStateTaskExecuter.java:46)
at org.gradle.api.internal.tasks.execution.CleanupStaleOutputsExecuter.execute(CleanupStaleOutputsExecuter.java:94)
at org.gradle.api.internal.tasks.execution.FinalizePropertiesTaskExecuter.execute(FinalizePropertiesTaskExecuter.java:46)
at org.gradle.api.internal.tasks.execution.ResolveTaskExecutionModeExecuter.execute(ResolveTaskExecutionModeExecuter.java:95)
at org.gradle.api.internal.tasks.execution.SkipTaskWithNoActionsExecuter.execute(SkipTaskWithNoActionsExecuter.java:57)
at org.gradle.api.internal.tasks.execution.SkipOnlyIfTaskExecuter.execute(SkipOnlyIfTaskExecuter.java:56)
at org.gradle.api.internal.tasks.execution.CatchExceptionTaskExecuter.execute(CatchExceptionTaskExecuter.java:36)
at org.gradle.api.internal.tasks.execution.EventFiringTaskExecuter$1.executeTask(EventFiringTaskExecuter.java:77)
at org.gradle.api.internal.tasks.execution.EventFiringTaskExecuter$1.call(EventFiringTaskExecuter.java:55)
at org.gradle.api.internal.tasks.execution.EventFiringTaskExecuter$1.call(EventFiringTaskExecuter.java:52)
at org.gradle.internal.operations.DefaultBuildOperationExecutor$CallableBuildOperationWorker.execute(DefaultBuildOperationExecutor.java:416)
at org.gradle.internal.operations.DefaultBuildOperationExecutor$CallableBuildOperationWorker.execute(DefaultBuildOperationExecutor.java:406)
at org.gradle.internal.operations.DefaultBuildOperationExecutor$1.execute(DefaultBuildOperationExecutor.java:165)
at org.gradle.internal.operations.DefaultBuildOperationExecutor.execute(DefaultBuildOperationExecutor.java:250)
at org.gradle.internal.operations.DefaultBuildOperationExecutor.execute(DefaultBuildOperationExecutor.java:158)
at org.gradle.internal.operations.DefaultBuildOperationExecutor.call(DefaultBuildOperationExecutor.java:102)
at org.gradle.internal.operations.DelegatingBuildOperationExecutor.call(DelegatingBuildOperationExecutor.java:36)
at org.gradle.api.internal.tasks.execution.EventFiringTaskExecuter.execute(EventFiringTaskExecuter.java:52)
at org.gradle.execution.plan.LocalTaskNodeExecutor.execute(LocalTaskNodeExecutor.java:43)
at org.gradle.execution.taskgraph.DefaultTaskExecutionGraph$InvokeNodeExecutorsAction.execute(DefaultTaskExecutionGraph.java:355)
at org.gradle.execution.taskgraph.DefaultTaskExecutionGraph$InvokeNodeExecutorsAction.execute(DefaultTaskExecutionGraph.java:343)
at org.gradle.execution.taskgraph.DefaultTaskExecutionGraph$BuildOperationAwareExecutionAction.execute(DefaultTaskExecutionGraph.java:336)
at org.gradle.execution.taskgraph.DefaultTaskExecutionGraph$BuildOperationAwareExecutionAction.execute(DefaultTaskExecutionGraph.java:322)
at org.gradle.execution.plan.DefaultPlanExecutor$ExecutorWorker$1.execute(DefaultPlanExecutor.java:134)
at org.gradle.execution.plan.DefaultPlanExecutor$ExecutorWorker$1.execute(DefaultPlanExecutor.java:129)
at org.gradle.execution.plan.DefaultPlanExecutor$ExecutorWorker.execute(DefaultPlanExecutor.java:202)
at org.gradle.execution.plan.DefaultPlanExecutor$ExecutorWorker.executeNextNode(DefaultPlanExecutor.java:193)
at org.gradle.execution.plan.DefaultPlanExecutor$ExecutorWorker.run(DefaultPlanExecutor.java:129)
at org.gradle.execution.plan.DefaultPlanExecutor.process(DefaultPlanExecutor.java:74)
at org.gradle.execution.taskgraph.DefaultTaskExecutionGraph.executeWithServices(DefaultTaskExecutionGraph.java:178)
at org.gradle.execution.taskgraph.DefaultTaskExecutionGraph.execute(DefaultTaskExecutionGraph.java:154)
at org.gradle.execution.SelectedTaskExecutionAction.execute(SelectedTaskExecutionAction.java:41)
at org.gradle.execution.DefaultBuildWorkExecutor.execute(DefaultBuildWorkExecutor.java:40)
at org.gradle.execution.DefaultBuildWorkExecutor.access$000(DefaultBuildWorkExecutor.java:24)
at org.gradle.execution.DefaultBuildWorkExecutor$1.proceed(DefaultBuildWorkExecutor.java:48)
at org.gradle.execution.DryRunBuildExecutionAction.execute(DryRunBuildExecutionAction.java:49)
at org.gradle.execution.DefaultBuildWorkExecutor.execute(DefaultBuildWorkExecutor.java:40)
at org.gradle.execution.DefaultBuildWorkExecutor.execute(DefaultBuildWorkExecutor.java:33)
at org.gradle.execution.IncludedBuildLifecycleBuildWorkExecutor.execute(IncludedBuildLifecycleBuildWorkExecutor.java:36)
at org.gradle.execution.BuildOperationFiringBuildWorkerExecutor$ExecuteTasks.run(BuildOperationFiringBuildWorkerExecutor.java:56)
at org.gradle.internal.operations.DefaultBuildOperationExecutor$RunnableBuildOperationWorker.execute(DefaultBuildOperationExecutor.java:402)
at org.gradle.internal.operations.DefaultBuildOperationExecutor$RunnableBuildOperationWorker.execute(DefaultBuildOperationExecutor.java:394)
at org.gradle.internal.operations.DefaultBuildOperationExecutor$1.execute(DefaultBuildOperationExecutor.java:165)
at org.gradle.internal.operations.DefaultBuildOperationExecutor.execute(DefaultBuildOperationExecutor.java:250)
at org.gradle.internal.operations.DefaultBuildOperationExecutor.execute(DefaultBuildOperationExecutor.java:158)
at org.gradle.internal.operations.DefaultBuildOperationExecutor.run(DefaultBuildOperationExecutor.java:92)
at org.gradle.internal.operations.DelegatingBuildOperationExecutor.run(DelegatingBuildOperationExecutor.java:31)
at org.gradle.execution.BuildOperationFiringBuildWorkerExecutor.execute(BuildOperationFiringBuildWorkerExecutor.java:41)
at org.gradle.initialization.DefaultGradleLauncher.runWork(DefaultGradleLauncher.java:236)
at org.gradle.initialization.DefaultGradleLauncher.doClassicBuildStages(DefaultGradleLauncher.java:147)
at org.gradle.initialization.DefaultGradleLauncher.doBuildStages(DefaultGradleLauncher.java:126)
at org.gradle.initialization.DefaultGradleLauncher.executeTasks(DefaultGradleLauncher.java:106)
at org.gradle.internal.invocation.GradleBuildController$1.execute(GradleBuildController.java:60)
at org.gradle.internal.invocation.GradleBuildController$1.execute(GradleBuildController.java:57)
at org.gradle.internal.invocation.GradleBuildController$3.create(GradleBuildController.java:85)
at org.gradle.internal.invocation.GradleBuildController$3.create(GradleBuildController.java:78)
at org.gradle.internal.work.DefaultWorkerLeaseService.withLocks(DefaultWorkerLeaseService.java:189)
at org.gradle.internal.work.StopShieldingWorkerLeaseService.withLocks(StopShieldingWorkerLeaseService.java:40)
at org.gradle.internal.invocation.GradleBuildController.doBuild(GradleBuildController.java:78)
at org.gradle.internal.invocation.GradleBuildController.run(GradleBuildController.java:57)
at org.gradle.tooling.internal.provider.ExecuteBuildActionRunner.run(ExecuteBuildActionRunner.java:31)
at org.gradle.launcher.exec.ChainingBuildActionRunner.run(ChainingBuildActionRunner.java:35)
at org.gradle.launcher.exec.BuildOutcomeReportingBuildActionRunner.run(BuildOutcomeReportingBuildActionRunner.java:63)
at org.gradle.tooling.internal.provider.ValidatingBuildActionRunner.run(ValidatingBuildActionRunner.java:32)
at org.gradle.launcher.exec.BuildCompletionNotifyingBuildActionRunner.run(BuildCompletionNotifyingBuildActionRunner.java:39)
at org.gradle.launcher.exec.RunAsBuildOperationBuildActionRunner$3.call(RunAsBuildOperationBuildActionRunner.java:51)
at org.gradle.launcher.exec.RunAsBuildOperationBuildActionRunner$3.call(RunAsBuildOperationBuildActionRunner.java:45)
at org.gradle.internal.operations.DefaultBuildOperationExecutor$CallableBuildOperationWorker.execute(DefaultBuildOperationExecutor.java:416)
at org.gradle.internal.operations.DefaultBuildOperationExecutor$CallableBuildOperationWorker.execute(DefaultBuildOperationExecutor.java:406)
at org.gradle.internal.operations.DefaultBuildOperationExecutor$1.execute(DefaultBuildOperationExecutor.java:165)
at org.gradle.internal.operations.DefaultBuildOperationExecutor.execute(DefaultBuildOperationExecutor.java:250)
at org.gradle.internal.operations.DefaultBuildOperationExecutor.execute(DefaultBuildOperationExecutor.java:158)
at org.gradle.internal.operations.DefaultBuildOperationExecutor.call(DefaultBuildOperationExecutor.java:102)
at org.gradle.internal.operations.DelegatingBuildOperationExecutor.call(DelegatingBuildOperationExecutor.java:36)
at org.gradle.launcher.exec.RunAsBuildOperationBuildActionRunner.run(RunAsBuildOperationBuildActionRunner.java:45)
at org.gradle.launcher.exec.InProcessBuildActionExecuter$1.transform(InProcessBuildActionExecuter.java:50)
at org.gradle.launcher.exec.InProcessBuildActionExecuter$1.transform(InProcessBuildActionExecuter.java:47)
at org.gradle.composite.internal.DefaultRootBuildState.run(DefaultRootBuildState.java:78)
at org.gradle.launcher.exec.InProcessBuildActionExecuter.execute(InProcessBuildActionExecuter.java:47)
at org.gradle.launcher.exec.InProcessBuildActionExecuter.execute(InProcessBuildActionExecuter.java:31)
at org.gradle.launcher.exec.BuildTreeScopeBuildActionExecuter.execute(BuildTreeScopeBuildActionExecuter.java:42)
at org.gradle.launcher.exec.BuildTreeScopeBuildActionExecuter.execute(BuildTreeScopeBuildActionExecuter.java:28)
at org.gradle.tooling.internal.provider.ContinuousBuildActionExecuter.execute(ContinuousBuildActionExecuter.java:78)
at org.gradle.tooling.internal.provider.ContinuousBuildActionExecuter.execute(ContinuousBuildActionExecuter.java:52)
at org.gradle.tooling.internal.provider.SubscribableBuildActionExecuter.execute(SubscribableBuildActionExecuter.java:59)
at org.gradle.tooling.internal.provider.SubscribableBuildActionExecuter.execute(SubscribableBuildActionExecuter.java:36)
at org.gradle.tooling.internal.provider.SessionScopeBuildActionExecuter.execute(SessionScopeBuildActionExecuter.java:68)
at org.gradle.tooling.internal.provider.SessionScopeBuildActionExecuter.execute(SessionScopeBuildActionExecuter.java:38)
at org.gradle.tooling.internal.provider.GradleThreadBuildActionExecuter.execute(GradleThreadBuildActionExecuter.java:37)
at org.gradle.tooling.internal.provider.GradleThreadBuildActionExecuter.execute(GradleThreadBuildActionExecuter.java:26)
at org.gradle.tooling.internal.provider.ParallelismConfigurationBuildActionExecuter.execute(ParallelismConfigurationBuildActionExecuter.java:43)
at org.gradle.tooling.internal.provider.ParallelismConfigurationBuildActionExecuter.execute(ParallelismConfigurationBuildActionExecuter.java:29)
at org.gradle.tooling.internal.provider.StartParamsValidatingActionExecuter.execute(StartParamsValidatingActionExecuter.java:60)
at org.gradle.tooling.internal.provider.StartParamsValidatingActionExecuter.execute(StartParamsValidatingActionExecuter.java:32)
at org.gradle.tooling.internal.provider.SessionFailureReportingActionExecuter.execute(SessionFailureReportingActionExecuter.java:55)
at org.gradle.tooling.internal.provider.SessionFailureReportingActionExecuter.execute(SessionFailureReportingActionExecuter.java:41)
at org.gradle.tooling.internal.provider.SetupLoggingActionExecuter.execute(SetupLoggingActionExecuter.java:48)
at org.gradle.tooling.internal.provider.SetupLoggingActionExecuter.execute(SetupLoggingActionExecuter.java:32)
at org.gradle.launcher.daemon.server.exec.ExecuteBuild.doBuild(ExecuteBuild.java:68)
at org.gradle.launcher.daemon.server.exec.BuildCommandOnly.execute(BuildCommandOnly.java:37)
at org.gradle.launcher.daemon.server.api.DaemonCommandExecution.proceed(DaemonCommandExecution.java:104)
at org.gradle.launcher.daemon.server.exec.WatchForDisconnection.execute(WatchForDisconnection.java:39)
at org.gradle.launcher.daemon.server.api.DaemonCommandExecution.proceed(DaemonCommandExecution.java:104)
at org.gradle.launcher.daemon.server.exec.ResetDeprecationLogger.execute(ResetDeprecationLogger.java:27)
at org.gradle.launcher.daemon.server.api.DaemonCommandExecution.proceed(DaemonCommandExecution.java:104)
at org.gradle.launcher.daemon.server.exec.RequestStopIfSingleUsedDaemon.execute(RequestStopIfSingleUsedDaemon.java:35)
at org.gradle.launcher.daemon.server.api.DaemonCommandExecution.proceed(DaemonCommandExecution.java:104)
at org.gradle.launcher.daemon.server.exec.ForwardClientInput$2.create(ForwardClientInput.java:78)
at org.gradle.launcher.daemon.server.exec.ForwardClientInput$2.create(ForwardClientInput.java:75)
at org.gradle.util.Swapper.swap(Swapper.java:38)
at org.gradle.launcher.daemon.server.exec.ForwardClientInput.execute(ForwardClientInput.java:75)
at org.gradle.launcher.daemon.server.api.DaemonCommandExecution.proceed(DaemonCommandExecution.java:104)
at org.gradle.launcher.daemon.server.exec.LogAndCheckHealth.execute(LogAndCheckHealth.java:55)
at org.gradle.launcher.daemon.server.api.DaemonCommandExecution.proceed(DaemonCommandExecution.java:104)
at org.gradle.launcher.daemon.server.exec.LogToClient.doBuild(LogToClient.java:63)
at org.gradle.launcher.daemon.server.exec.BuildCommandOnly.execute(BuildCommandOnly.java:37)
at org.gradle.launcher.daemon.server.api.DaemonCommandExecution.proceed(DaemonCommandExecution.java:104)
at org.gradle.launcher.daemon.server.exec.EstablishBuildEnvironment.doBuild(EstablishBuildEnvironment.java:82)
at org.gradle.launcher.daemon.server.exec.BuildCommandOnly.execute(BuildCommandOnly.java:37)
at org.gradle.launcher.daemon.server.api.DaemonCommandExecution.proceed(DaemonCommandExecution.java:104)
at org.gradle.launcher.daemon.server.exec.StartBuildOrRespondWithBusy$1.run(StartBuildOrRespondWithBusy.java:52)
at org.gradle.launcher.daemon.server.DaemonStateCoordinator$1.run(DaemonStateCoordinator.java:297)
at org.gradle.internal.concurrent.ExecutorPolicy$CatchAndRecordFailures.onExecute(ExecutorPolicy.java:64)
at org.gradle.internal.concurrent.ManagedExecutorImpl$1.run(ManagedExecutorImpl.java:48)
at org.gradle.internal.concurrent.ThreadFactoryImpl$ManagedThreadRunnable.run(ThreadFactoryImpl.java:56)
Caused by: org.gradle.process.internal.ExecException: Process 'Gradle Test Executor 2' finished with non-zero exit value 1
at org.gradle.process.internal.DefaultExecHandle$ExecResultImpl.assertNormalExitValue(DefaultExecHandle.java:409)
at org.gradle.process.internal.worker.DefaultWorkerProcess.onProcessStop(DefaultWorkerProcess.java:141)
at org.gradle.process.internal.worker.DefaultWorkerProcess.access$000(DefaultWorkerProcess.java:42)
at org.gradle.process.internal.worker.DefaultWorkerProcess$1.executionFinished(DefaultWorkerProcess.java:94)
at java.base/jdk.internal.reflect.NativeMethodAccessorImpl.invoke0(Native Method)
at java.base/jdk.internal.reflect.NativeMethodAccessorImpl.invoke(NativeMethodAccessorImpl.java:62)
at java.base/jdk.internal.reflect.DelegatingMethodAccessorImpl.invoke(DelegatingMethodAccessorImpl.java:43)
at org.gradle.internal.dispatch.ReflectionDispatch.dispatch(ReflectionDispatch.java:36)
at org.gradle.internal.dispatch.ReflectionDispatch.dispatch(ReflectionDispatch.java:24)
at org.gradle.internal.event.AbstractBroadcastDispatch.dispatch(AbstractBroadcastDispatch.java:42)
at org.gradle.internal.event.BroadcastDispatch$SingletonDispatch.dispatch(BroadcastDispatch.java:231)
at org.gradle.internal.event.BroadcastDispatch$SingletonDispatch.dispatch(BroadcastDispatch.java:150)
at org.gradle.internal.event.ListenerBroadcast.dispatch(ListenerBroadcast.java:141)
at org.gradle.internal.event.ListenerBroadcast.dispatch(ListenerBroadcast.java:37)
at org.gradle.internal.dispatch.ProxyDispatchAdapter$DispatchingInvocationHandler.invoke(ProxyDispatchAdapter.java:94)
at com.sun.proxy.$Proxy72.executionFinished(Unknown Source)
at org.gradle.process.internal.DefaultExecHandle.setEndStateInfo(DefaultExecHandle.java:217)
at org.gradle.process.internal.DefaultExecHandle.finished(DefaultExecHandle.java:349)
at org.gradle.process.internal.ExecHandleRunner.completed(ExecHandleRunner.java:110)
at org.gradle.process.internal.ExecHandleRunner.run(ExecHandleRunner.java:84)
at org.gradle.internal.operations.CurrentBuildOperationPreservingRunnable.run(CurrentBuildOperationPreservingRunnable.java:42)
... 3 more
* Get more help at https://help.gradle.org
BUILD FAILED in 25s
6 actionable tasks: 5 executed, 1 up-to-date
Uploading artifacts for failed job 00:01
Uploading artifacts...
./build/reports/tests/*: found 1 matching files and directories
Uploading artifacts as "archive" to coordinator... 201 Created id=117582 responseStatus=201 Created token=zCtGHvC_
Uploading artifacts...
WARNING: ./build/test-results/test/*.xml: no matching files. Ensure that the artifact path is relative to the working directory
ERROR: No files to upload
Cleaning up project directory and file based variables 00:01
ERROR: Job failed: exit code 1
Some notes
UPDATE 1: It looks like adding the logging of the test descriptor shows that the issue is not loading of individual tests, but plainly finding the main class to start the tests. Again it needs to be mentioned that this issue is environment-bound. Gradle is perfectly able to find the main class when run locally on my developer workstation.
This Gitlab ci runner runs perfectly with other projects
The project is a grails plugin, although I don't believe it is relevant (The build runs locally, in a container, running the same exact command!)
What else could I do (apart from running the same command as the runner in the same container) to help me reproduce this situation outside of a pipeline run?
Is there a way to start a runner and join the runtime to tinker around and inspect the context?
I can't share the full project for confidentiality reasons.
Any help appreciated
Solution
After following the suggestion of #PrasadU I was able to hone in on the issue (copied from the comments section):
Ok, after gradually reducing my application to a default pristine grails plugin, and still failing each and every build, I looked into your suggestion to check the environment variables. There is one environment variable defined in gitlab-ci that is not defined in my local setup. GRAILS_OPTS: -Xms512m -Xmx512m
After removing this env var, gradle is able to start the tests! I have tried with and without quotes, and this seems to be the issue. Defining it locally in my test container allows me to replicate the issue.
After tinkering around with the contents of this variable, it looks like grails (version 4.0.5) is doing a bad job of parsing this variable! If you look at the value carefully, there are 2 spaces between the -Xmx and the -Xms option. This is what causes the crash. When I change it for -Xms512m -Xmx512m (one single space), Everything works.
After modifying the .gitlab-ci.yml file appropriately, the build passes:
stages:
- test
- deploy
variables:
GRAILS_OPTS: -Xms512m -Xmx512m
DEPLOYMENT: CI
test_plugin:
image: adoptopenjdk:11-jdk
stage: test
script:
- ./scripts/bash/run_plugin_tests.sh
artifacts:
when: always
expire_in: 7d
reports:
junit:
- ./build/test-results/test/*.xml
paths:
- ./build/reports/tests/*
deploy_plugin:
image: adoptopenjdk:11-jdk
stage: deploy
script:
- ./scripts/bash/deploy_plugin.sh
dependencies:
- test_plugin
#Only on master branch
only:
- main
check for local changes that are not checked in or some ENV setup on your machine that is not on the gitlab-runner ; you can checkout the code base in a new machine and run to try to replicate.

Grails 4 run-app on WIndows 10 throws error = 206 filename or extension is too long, yet Grails 3 with the same app is fine. How to fix grails 4?

Have converted a number of Grails 3 plugins to Grails 4. One of the Grails 4 plugins throws an error = 206 filename or extension is too long when invoking run-app. The command line and output follows. You can see that a pathing jar is in use for the run-app invocation, yet somewhere down the line the classpath is expanded and is causing this exception. Is there a cure for this on a Windows platform?
"C:\Program Files\Java\jdk1.8.0_301\bin\java.exe" -XX:+TieredCompilation -XX:TieredStopAtLevel=1 -XX:CICompilerCount=3 -Djline.WindowsTerminal.directConsole=false -Dgrails.full.stacktrace=true -Dfile.encoding=UTF-8 -classpath C:\Users\jay\AppData\Local\Temp\classpath1957686578.jar org.grails.cli.GrailsCli run-app --stacktrace --plain-output
|Running application...
FAILURE: Build failed with an exception.
* What went wrong:
Execution failed for task ':bootRun'.
> A problem occurred starting process 'command 'C:\Program Files\Java\jdk1.8.0_301\bin\java.exe''
* Try:
Run with --info or --debug option to get more log output. Run with --scan to get full insights.
* Exception is:
org.gradle.api.tasks.TaskExecutionException: Execution failed for task ':bootRun'.
at org.gradle.api.internal.tasks.execution.ExecuteActionsTaskExecuter.executeActions(ExecuteActionsTaskExecuter.java:96)
at org.gradle.api.internal.tasks.execution.ExecuteActionsTaskExecuter.execute(ExecuteActionsTaskExecuter.java:65)
at org.gradle.api.internal.tasks.execution.ActionEventFiringTaskExecuter.execute(ActionEventFiringTaskExecuter.java:44)
at org.gradle.api.internal.tasks.execution.TimeoutTaskExecuter.execute(TimeoutTaskExecuter.java:53)
<< more stacktrace omitted >>
Caused by: org.gradle.process.internal.ExecException: A problem occurred starting process 'command 'C:\Program Files\Java\jdk1.8.0_301\bin\java.exe''
at org.gradle.process.internal.DefaultExecHandle.execExceptionFor(DefaultExecHandle.java:232)
at org.gradle.process.internal.DefaultExecHandle.setEndStateInfo(DefaultExecHandle.java:209)
at org.gradle.process.internal.DefaultExecHandle.failed(DefaultExecHandle.java:356)
at org.gradle.process.internal.ExecHandleRunner.run(ExecHandleRunner.java:86)
at org.gradle.internal.operations.CurrentBuildOperationPreservingRunnable.run(CurrentBuildOperationPreservingRunnable.java:42)
... 3 more
Caused by: net.rubygrapefruit.platform.NativeException: Could not start 'C:\Program Files\Java\jdk1.8.0_301\bin\java.exe'
at net.rubygrapefruit.platform.internal.DefaultProcessLauncher.start(DefaultProcessLauncher.java:27)
at net.rubygrapefruit.platform.internal.WindowsProcessLauncher.start(WindowsProcessLauncher.java:22)
at net.rubygrapefruit.platform.internal.WrapperProcessLauncher.start(WrapperProcessLauncher.java:36)
at org.gradle.process.internal.ExecHandleRunner.startProcess(ExecHandleRunner.java:97)
at org.gradle.process.internal.ExecHandleRunner.run(ExecHandleRunner.java:70)
... 4 more
Caused by: java.io.IOException: Cannot run program "C:\Program Files\Java\jdk1.8.0_301\bin\java.exe" (in directory "C:\JtmdGrailsPlugin"): CreateProcess error=206, The filename or extension is too long
at net.rubygrapefruit.platform.internal.DefaultProcessLauncher.start(DefaultProcessLauncher.java:25)
... 8 more
Caused by: java.io.IOException: CreateProcess error=206, The filename or extension is too long
... 9 more
* Get more help at https://help.gradle.org
BUILD FAILED in 3s
Error |
Failed to start server (NOTE: Stack trace has been filtered. Use --verbose to see entire trace.)
java.util.concurrent.ExecutionException: org.gradle.tooling.BuildException: Could not execute build using Gradle distribution 'https://services.gradle.org/distributions/gradle-5.0-bin.zip'.
at java_util_concurrent_Future$get.call(Unknown Source)
at run-app.run(run-app.groovy:89)
at org.grails.cli.profile.commands.script.GroovyScriptCommand.handle(GroovyScriptCommand.groovy:152)
at org.grails.cli.profile.AbstractProfile.handleCommand(AbstractProfile.groovy:482)
at org.grails.cli.GrailsCli.handleCommand(GrailsCli.groovy:377)
at org.grails.cli.GrailsCli.handleCommand(GrailsCli.groovy:350)
at org.grails.cli.GrailsCli.execute(GrailsCli.groovy:271)
at org.grails.cli.GrailsCli.main(GrailsCli.groovy:159)
Caused by: org.gradle.tooling.BuildException: Could not execute build using Gradle distribution 'https://services.gradle.org/distributions/gradle-5.0-bin.zip'.
at org.gradle.tooling.internal.consumer.ExceptionTransformer.transform(ExceptionTransformer.java:51)
at org.gradle.tooling.internal.consumer.ExceptionTransformer.transform(ExceptionTransformer.java:29)
at org.gradle.tooling.internal.consumer.ResultHandlerAdapter.onFailure(ResultHandlerAdapter.java:41)
<< more stacktrace omitted >>
Caused by: org.gradle.process.internal.ExecException: A problem occurred starting process 'command 'C:\Program Files\Java\jdk1.8.0_301\bin\java.exe''
at org.gradle.process.internal.DefaultExecHandle.execExceptionFor(DefaultExecHandle.java:232)
at org.gradle.process.internal.DefaultExecHandle.setEndStateInfo(DefaultExecHandle.java:209)
at org.gradle.process.internal.DefaultExecHandle.failed(DefaultExecHandle.java:356)
at org.gradle.process.internal.ExecHandleRunner.run(ExecHandleRunner.java:86)
at org.gradle.internal.operations.CurrentBuildOperationPreservingRunnable.run(CurrentBuildOperationPreservingRunnable.java:42)
... 3 more
Caused by: net.rubygrapefruit.platform.NativeException: Could not start 'C:\Program Files\Java\jdk1.8.0_301\bin\java.exe'
at net.rubygrapefruit.platform.internal.DefaultProcessLauncher.start(DefaultProcessLauncher.java:27)
at net.rubygrapefruit.platform.internal.WindowsProcessLauncher.start(WindowsProcessLauncher.java:22)
at net.rubygrapefruit.platform.internal.WrapperProcessLauncher.start(WrapperProcessLauncher.java:36)
at org.gradle.process.internal.ExecHandleRunner.startProcess(ExecHandleRunner.java:97)
at org.gradle.process.internal.ExecHandleRunner.run(ExecHandleRunner.java:70)
... 4 more
Caused by: java.io.IOException: Cannot run program "C:\Program Files\Java\jdk1.8.0_301\bin\java.exe" (in directory "C:\JtmdGrailsPlugin"): CreateProcess error=206, The filename or extension is too long
at net.rubygrapefruit.platform.internal.DefaultProcessLauncher.start(DefaultProcessLauncher.java:25)
... 8 more
Caused by: java.io.IOException: CreateProcess error=206, The filename or extension is too long
... 9 more
Error |
Failed to start server
Process finished with exit code 1
Although in the invocation it appears that a pathing jar is active, adding this explicitly (as per the grails 4 documentation - bad on me) seems to have cured the problem.
grails { pathingJar = true }

Gobblin build failed with TaskExecutionException

I have clone the apache gobblin repo from master branch and followed the instructions mentioned here to build the code.
Build is failing with TaskExecutionException for one of the tasks. It seems this task is failing because of NullPointerException.
Below is the stacktrace of build failure
Exception in thread "main" java.lang.NullPointerException
at com.linkedin.restli.tools.snapshot.check.AbstractSnapshot.parseModels(AbstractSnapshot.java:35)
at com.linkedin.restli.tools.snapshot.check.Snapshot.<init>(Snapshot.java:40)
at com.linkedin.restli.tools.snapshot.check.RestLiSnapshotCompatibilityChecker.checkCompatibility(RestLiSnapshotCompatibilityChecker.java:224)
at com.linkedin.restli.tools.snapshot.check.RestLiSnapshotCompatibilityChecker.main(RestLiSnapshotCompatibilityChecker.java:120)
Download https://repo.maven.apache.org/maven2/org/bouncycastle/bcpg-jdk15on/1.52/bcpg-jdk15on-1.52.pom
Download https://repo.maven.apache.org/maven2/org/bouncycastle/bcprov-jdk15on/1.52/bcprov-jdk15on-1.52.pom
FAILURE: Build failed with an exception.
* What went wrong:
Execution failed for task ':gobblin-rest-service:gobblin-rest-server:checkRestModel'.
> Process 'command 'C:\Program Files\Java\jdk1.8.0_162\bin\java.exe'' finished with non-zero exit value 1
* Try:
Run with --info or --debug option to get more log output. Run with --scan to get full insights.
* Exception is:
org.gradle.api.tasks.TaskExecutionException: Execution failed for task ':gobblin-rest-service:gobblin-rest-server:checkRestModel'.
at org.gradle.api.internal.tasks.execution.ExecuteActionsTaskExecuter.executeActions(ExecuteActionsTaskExecuter.java:110)
at org.gradle.api.internal.tasks.execution.ExecuteActionsTaskExecuter.execute(ExecuteActionsTaskExecuter.java:77)
at org.gradle.api.internal.tasks.execution.OutputDirectoryCreatingTaskExecuter.execute(OutputDirectoryCreatingTaskExecuter.java:51)
at org.gradle.api.internal.tasks.execution.SkipUpToDateTaskExecuter.execute(SkipUpToDateTaskExecuter.java:59)
at org.gradle.api.internal.tasks.execution.ResolveTaskOutputCachingStateExecuter.execute(ResolveTaskOutputCachingStateExecuter.java:54)
at org.gradle.api.internal.tasks.execution.ValidatingTaskExecuter.execute(ValidatingTaskExecuter.java:59)
at org.gradle.api.internal.tasks.execution.SkipEmptySourceFilesTaskExecuter.execute(SkipEmptySourceFilesTaskExecuter.java:101)
at org.gradle.api.internal.tasks.execution.FinalizeInputFilePropertiesTaskExecuter.execute(FinalizeInputFilePropertiesTaskExecuter.java:44)
at org.gradle.api.internal.tasks.execution.CleanupStaleOutputsExecuter.execute(CleanupStaleOutputsExecuter.java:91)
at org.gradle.api.internal.tasks.execution.ResolveTaskArtifactStateTaskExecuter.execute(ResolveTaskArtifactStateTaskExecuter.java:62)
at org.gradle.api.internal.tasks.execution.SkipTaskWithNoActionsExecuter.execute(SkipTaskWithNoActionsExecuter.java:59)
at org.gradle.api.internal.tasks.execution.SkipOnlyIfTaskExecuter.execute(SkipOnlyIfTaskExecuter.java:54)
at org.gradle.api.internal.tasks.execution.ExecuteAtMostOnceTaskExecuter.execute(ExecuteAtMostOnceTaskExecuter.java:43)
at org.gradle.api.internal.tasks.execution.CatchExceptionTaskExecuter.execute(CatchExceptionTaskExecuter.java:34)
at org.gradle.api.internal.tasks.execution.EventFiringTaskExecuter$1.run(EventFiringTaskExecuter.java:51)
at org.gradle.internal.operations.DefaultBuildOperationExecutor$RunnableBuildOperationWorker.execute(DefaultBuildOperationExecutor.java:300)
at org.gradle.internal.operations.DefaultBuildOperationExecutor$RunnableBuildOperationWorker.execute(DefaultBuildOperationExecutor.java:292)
at org.gradle.internal.operations.DefaultBuildOperationExecutor.execute(DefaultBuildOperationExecutor.java:174)
at org.gradle.internal.operations.DefaultBuildOperationExecutor.run(DefaultBuildOperationExecutor.java:90)
at org.gradle.internal.operations.DelegatingBuildOperationExecutor.run(DelegatingBuildOperationExecutor.java:31)
at org.gradle.api.internal.tasks.execution.EventFiringTaskExecuter.execute(EventFiringTaskExecuter.java:46)
at org.gradle.execution.taskgraph.LocalTaskInfoExecutor.execute(LocalTaskInfoExecutor.java:42)
at org.gradle.execution.taskgraph.DefaultTaskExecutionGraph$BuildOperationAwareWorkItemExecutor.execute(DefaultTaskExecutionGraph.java:273)
at org.gradle.execution.taskgraph.DefaultTaskExecutionGraph$BuildOperationAwareWorkItemExecutor.execute(DefaultTaskExecutionGraph.java:258)
at org.gradle.execution.taskgraph.DefaultTaskPlanExecutor$ExecutorWorker$1.execute(DefaultTaskPlanExecutor.java:135)
at org.gradle.execution.taskgraph.DefaultTaskPlanExecutor$ExecutorWorker$1.execute(DefaultTaskPlanExecutor.java:130)
at org.gradle.execution.taskgraph.DefaultTaskPlanExecutor$ExecutorWorker.execute(DefaultTaskPlanExecutor.java:200)
at org.gradle.execution.taskgraph.DefaultTaskPlanExecutor$ExecutorWorker.executeWithWork(DefaultTaskPlanExecutor.java:191)
at org.gradle.execution.taskgraph.DefaultTaskPlanExecutor$ExecutorWorker.run(DefaultTaskPlanExecutor.java:130)
at org.gradle.internal.concurrent.ExecutorPolicy$CatchAndRecordFailures.onExecute(ExecutorPolicy.java:63)
at org.gradle.internal.concurrent.ManagedExecutorImpl$1.run(ManagedExecutorImpl.java:46)
at org.gradle.internal.concurrent.ThreadFactoryImpl$ManagedThreadRunnable.run(ThreadFactoryImpl.java:55)
Caused by: org.gradle.process.internal.ExecException: Process 'command 'C:\Program Files\Java\jdk1.8.0_162\bin\java.exe'' finished with non-zero exit value 1
at org.gradle.process.internal.DefaultExecHandle$ExecResultImpl.assertNormalExitValue(DefaultExecHandle.java:395)
at org.gradle.process.internal.DefaultJavaExecAction.execute(DefaultJavaExecAction.java:37)
at org.gradle.api.internal.file.DefaultFileOperations.javaexec(DefaultFileOperations.java:192)
at org.gradle.api.internal.project.DefaultProject.javaexec(DefaultProject.java:1092)
at org.gradle.api.internal.project.DefaultProject.javaexec(DefaultProject.java:1087)
at org.gradle.api.Project$javaexec$23.call(Unknown Source)
at com.linkedin.pegasus.gradle.tasks.CheckRestModelTask.check(CheckRestModelTask.groovy:67)
at org.gradle.internal.reflect.JavaMethod.invoke(JavaMethod.java:73)
at org.gradle.api.internal.project.taskfactory.StandardTaskAction.doExecute(StandardTaskAction.java:46)
at org.gradle.api.internal.project.taskfactory.StandardTaskAction.execute(StandardTaskAction.java:39)
at org.gradle.api.internal.project.taskfactory.StandardTaskAction.execute(StandardTaskAction.java:26)
at org.gradle.api.internal.AbstractTask$TaskActionWrapper.execute(AbstractTask.java:786)
at org.gradle.api.internal.AbstractTask$TaskActionWrapper.execute(AbstractTask.java:753)
at org.gradle.api.internal.tasks.execution.ExecuteActionsTaskExecuter$1.run(ExecuteActionsTaskExecuter.java:131)
at org.gradle.internal.operations.DefaultBuildOperationExecutor$RunnableBuildOperationWorker.execute(DefaultBuildOperationExecutor.java:300)
at org.gradle.internal.operations.DefaultBuildOperationExecutor$RunnableBuildOperationWorker.execute(DefaultBuildOperationExecutor.java:292)
at org.gradle.internal.operations.DefaultBuildOperationExecutor.execute(DefaultBuildOperationExecutor.java:174)
at org.gradle.internal.operations.DefaultBuildOperationExecutor.run(DefaultBuildOperationExecutor.java:90)
at org.gradle.internal.operations.DelegatingBuildOperationExecutor.run(DelegatingBuildOperationExecutor.java:31)
at org.gradle.api.internal.tasks.execution.ExecuteActionsTaskExecuter.executeAction(ExecuteActionsTaskExecuter.java:120)
at org.gradle.api.internal.tasks.execution.ExecuteActionsTaskExecuter.executeActions(ExecuteActionsTaskExecuter.java:99)
... 31 more
I have also tried ./gradlew :gobblin-distribution:buildDistributionTar to build.
Please note that I am using windows 10 and Java 8.
Checking a REST model is an optional build step that you can skip. Try running:
./gradlew build -x checkRestModel -x findbugsMain -x test -x rat -x checkstyleMain
Some of the Gobblin features don't work well on Windows, and you can get better experience developing on Linux or Mac OS.

Unable to delete file: C:\Users\...\corda-settler-manual\cordapp-contracts-states\build\libs\cordapp-contracts-states-0.1.jar

I'm currently trying to run this corda-settler with manual payment rail sample built by countfloyd from github. Here's the link to his repo. When running the command gradlew clean deployNodes on the terminal, I encountered the error below and I'm unsure of how to resolve it:
C:\Users\aikka\Desktop\corda-settler-manual>gradlew --stacktrace clean deployNodes
> Task :cordapp-contracts-states:clean FAILED
FAILURE: Build failed with an exception.
* What went wrong:
Execution failed for task ':cordapp-contracts-states:clean'.
> Unable to delete file: C:\Users\aikka\Desktop\corda-settler-manual\cordapp-contracts-states\build\libs\cordapp-contracts-states-0.1.jar
* Try:
Run with --info or --debug option to get more log output. Run with --scan to get full insights.
* Exception is:
org.gradle.api.tasks.TaskExecutionException: Execution failed for task ':cordapp-contracts-states:clean'.
at org.gradle.api.internal.tasks.execution.ExecuteActionsTaskExecuter.executeActions(ExecuteActionsTaskExecuter.java:110)
at org.gradle.api.internal.tasks.execution.ExecuteActionsTaskExecuter.execute(ExecuteActionsTaskExecuter.java:77)
at org.gradle.api.internal.tasks.execution.OutputDirectoryCreatingTaskExecuter.execute(OutputDirectoryCreatingTaskExecuter.java:51)
at org.gradle.api.internal.tasks.execution.SkipUpToDateTaskExecuter.execute(SkipUpToDateTaskExecuter.java:59)
at org.gradle.api.internal.tasks.execution.ResolveTaskOutputCachingStateExecuter.execute(ResolveTaskOutputCachingStateExecuter.java:54)
at org.gradle.api.internal.tasks.execution.ValidatingTaskExecuter.execute(ValidatingTaskExecuter.java:59)
at org.gradle.api.internal.tasks.execution.SkipEmptySourceFilesTaskExecuter.execute(SkipEmptySourceFilesTaskExecuter.java:101)
at org.gradle.api.internal.tasks.execution.FinalizeInputFilePropertiesTaskExecuter.execute(FinalizeInputFilePropertiesTaskExecuter.java:44)
at org.gradle.api.internal.tasks.execution.CleanupStaleOutputsExecuter.execute(CleanupStaleOutputsExecuter.java:91)
at org.gradle.api.internal.tasks.execution.ResolveTaskArtifactStateTaskExecuter.execute(ResolveTaskArtifactStateTaskExecuter.java:62)
at org.gradle.api.internal.tasks.execution.SkipTaskWithNoActionsExecuter.execute(SkipTaskWithNoActionsExecuter.java:59)
at org.gradle.api.internal.tasks.execution.SkipOnlyIfTaskExecuter.execute(SkipOnlyIfTaskExecuter.java:54)
at org.gradle.api.internal.tasks.execution.ExecuteAtMostOnceTaskExecuter.execute(ExecuteAtMostOnceTaskExecuter.java:43)
at org.gradle.api.internal.tasks.execution.CatchExceptionTaskExecuter.execute(CatchExceptionTaskExecuter.java:34)
at org.gradle.api.internal.tasks.execution.EventFiringTaskExecuter$1.run(EventFiringTaskExecuter.java:51)
at org.gradle.internal.operations.DefaultBuildOperationExecutor$RunnableBuildOperationWorker.execute(DefaultBuildOperationExecutor.java:301)
at org.gradle.internal.operations.DefaultBuildOperationExecutor$RunnableBuildOperationWorker.execute(DefaultBuildOperationExecutor.java:293)
at org.gradle.internal.operations.DefaultBuildOperationExecutor.execute(DefaultBuildOperationExecutor.java:175)
at org.gradle.internal.operations.DefaultBuildOperationExecutor.run(DefaultBuildOperationExecutor.java:91)
at org.gradle.internal.operations.DelegatingBuildOperationExecutor.run(DelegatingBuildOperationExecutor.java:31)
at org.gradle.api.internal.tasks.execution.EventFiringTaskExecuter.execute(EventFiringTaskExecuter.java:46)
at org.gradle.execution.taskgraph.LocalTaskInfoExecutor.execute(LocalTaskInfoExecutor.java:42)
at org.gradle.execution.taskgraph.DefaultTaskExecutionGraph$BuildOperationAwareWorkItemExecutor.execute(DefaultTaskExecutionGraph.java:277)
at org.gradle.execution.taskgraph.DefaultTaskExecutionGraph$BuildOperationAwareWorkItemExecutor.execute(DefaultTaskExecutionGraph.java:262)
at org.gradle.execution.taskgraph.DefaultTaskPlanExecutor$ExecutorWorker$1.execute(DefaultTaskPlanExecutor.java:135)
at org.gradle.execution.taskgraph.DefaultTaskPlanExecutor$ExecutorWorker$1.execute(DefaultTaskPlanExecutor.java:130)
at org.gradle.execution.taskgraph.DefaultTaskPlanExecutor$ExecutorWorker.execute(DefaultTaskPlanExecutor.java:200)
at org.gradle.execution.taskgraph.DefaultTaskPlanExecutor$ExecutorWorker.executeWithWork(DefaultTaskPlanExecutor.java:191)
at org.gradle.execution.taskgraph.DefaultTaskPlanExecutor$ExecutorWorker.run(DefaultTaskPlanExecutor.java:130)
at org.gradle.internal.concurrent.ExecutorPolicy$CatchAndRecordFailures.onExecute(ExecutorPolicy.java:63)
at org.gradle.internal.concurrent.ManagedExecutorImpl$1.run(ManagedExecutorImpl.java:46)
at org.gradle.internal.concurrent.ThreadFactoryImpl$ManagedThreadRunnable.run(ThreadFactoryImpl.java:55)
Caused by: org.gradle.api.file.UnableToDeleteFileException: Unable to delete file: C:\Users\aikka\Desktop\corda-settler-manual\cordapp-contracts-states\build\libs\cordapp-contracts-states-0.1.jar
at org.gradle.api.internal.file.delete.Deleter.handleFailedDelete(Deleter.java:109)
at org.gradle.api.internal.file.delete.Deleter.doDeleteInternal(Deleter.java:86)
at org.gradle.api.internal.file.delete.Deleter.doDeleteInternal(Deleter.java:81)
at org.gradle.api.internal.file.delete.Deleter.doDeleteInternal(Deleter.java:81)
at org.gradle.api.internal.file.delete.Deleter.delete(Deleter.java:66)
at org.gradle.api.tasks.Delete.clean(Delete.java:67)
at org.gradle.internal.reflect.JavaMethod.invoke(JavaMethod.java:73)
at org.gradle.api.internal.project.taskfactory.StandardTaskAction.doExecute(StandardTaskAction.java:46)
at org.gradle.api.internal.project.taskfactory.StandardTaskAction.execute(StandardTaskAction.java:39)
at org.gradle.api.internal.project.taskfactory.StandardTaskAction.execute(StandardTaskAction.java:26)
at org.gradle.api.internal.AbstractTask$TaskActionWrapper.execute(AbstractTask.java:801)
at org.gradle.api.internal.AbstractTask$TaskActionWrapper.execute(AbstractTask.java:768)
at org.gradle.api.internal.tasks.execution.ExecuteActionsTaskExecuter$1.run(ExecuteActionsTaskExecuter.java:131)
at org.gradle.internal.operations.DefaultBuildOperationExecutor$RunnableBuildOperationWorker.execute(DefaultBuildOperationExecutor.java:301)
at org.gradle.internal.operations.DefaultBuildOperationExecutor$RunnableBuildOperationWorker.execute(DefaultBuildOperationExecutor.java:293)
at org.gradle.internal.operations.DefaultBuildOperationExecutor.execute(DefaultBuildOperationExecutor.java:175)
at org.gradle.internal.operations.DefaultBuildOperationExecutor.run(DefaultBuildOperationExecutor.java:91)
at org.gradle.internal.operations.DelegatingBuildOperationExecutor.run(DelegatingBuildOperationExecutor.java:31)
at org.gradle.api.internal.tasks.execution.ExecuteActionsTaskExecuter.executeAction(ExecuteActionsTaskExecuter.java:120)
at org.gradle.api.internal.tasks.execution.ExecuteActionsTaskExecuter.executeActions(ExecuteActionsTaskExecuter.java:99)
... 31 more
* Get more help at https://help.gradle.org
BUILD FAILED in 2s
3 actionable tasks: 3 executed
Any help would be much appreciated.
Sometimes these things can just get locked up. There might be a process using them or you need to go and manually delete them.
I have had to sudo rm -rf a few build directories in the last few weeks.

How do I fix an OverlappingFileLockException when building with Gradle on Windows?

Upon attempting to walk through the Spring REST tutorial, which uses Gradle, I encountered an OverlappingFileLockException when trying to run ./gradlew clean test. When I tried to use a full installation of Gradle instead of the included wrapper, I would get the same exception. So, I decided to start much more simply, and follow Gradle's own Hello World example, with the same result. Here is the stacktrace:
FAILURE: Build failed with an exception.
* What went wrong:
A problem occurred configuring root project 'hello-world'.
> Could not open no_buildscript class cache for build file 'D:\gradle-playground\hello-world\build.gradle' (\\omafp01.co
rp.planetci.com\ramc01\.gradle\caches\1.11\scripts\build_5trnq1oe4m84o6rmggev8gku4t\ProjectScript\no_buildscript).
> java.nio.channels.OverlappingFileLockException (no error message)
* Try:
Run with --info or --debug option to get more log output.
* Exception is:
org.gradle.api.ProjectConfigurationException: A problem occurred configuring root project 'hello-world'.
at org.gradle.configuration.project.LifecycleProjectEvaluator.addConfigurationFailure(LifecycleProjectEvaluator.
java:79)
at org.gradle.configuration.project.LifecycleProjectEvaluator.evaluate(LifecycleProjectEvaluator.java:57)
at org.gradle.api.internal.project.AbstractProject.evaluate(AbstractProject.java:507)
at org.gradle.api.internal.project.AbstractProject.evaluate(AbstractProject.java:82)
at org.gradle.configuration.DefaultBuildConfigurer.configure(DefaultBuildConfigurer.java:31)
at org.gradle.initialization.DefaultGradleLauncher.doBuildStages(DefaultGradleLauncher.java:142)
at org.gradle.initialization.DefaultGradleLauncher.doBuild(DefaultGradleLauncher.java:113)
at org.gradle.initialization.DefaultGradleLauncher.run(DefaultGradleLauncher.java:81)
at org.gradle.launcher.exec.InProcessBuildActionExecuter$DefaultBuildController.run(InProcessBuildActionExecuter
.java:64)
at org.gradle.launcher.cli.ExecuteBuildAction.run(ExecuteBuildAction.java:33)
at org.gradle.launcher.cli.ExecuteBuildAction.run(ExecuteBuildAction.java:24)
at org.gradle.launcher.exec.InProcessBuildActionExecuter.execute(InProcessBuildActionExecuter.java:35)
at org.gradle.launcher.exec.InProcessBuildActionExecuter.execute(InProcessBuildActionExecuter.java:26)
at org.gradle.launcher.cli.RunBuildAction.run(RunBuildAction.java:50)
at org.gradle.internal.Actions$RunnableActionAdapter.execute(Actions.java:171)
at org.gradle.launcher.cli.CommandLineActionFactory$ParseAndBuildAction.execute(CommandLineActionFactory.java:20
1)
at org.gradle.launcher.cli.CommandLineActionFactory$ParseAndBuildAction.execute(CommandLineActionFactory.java:17
4)
at org.gradle.launcher.cli.CommandLineActionFactory$WithLogging.execute(CommandLineActionFactory.java:170)
at org.gradle.launcher.cli.CommandLineActionFactory$WithLogging.execute(CommandLineActionFactory.java:139)
at org.gradle.launcher.cli.ExceptionReportingAction.execute(ExceptionReportingAction.java:33)
at org.gradle.launcher.cli.ExceptionReportingAction.execute(ExceptionReportingAction.java:22)
at org.gradle.launcher.Main.doAction(Main.java:46)
at org.gradle.launcher.bootstrap.EntryPoint.run(EntryPoint.java:45)
at org.gradle.launcher.Main.main(Main.java:37)
at org.gradle.launcher.bootstrap.ProcessBootstrap.runNoExit(ProcessBootstrap.java:50)
at org.gradle.launcher.bootstrap.ProcessBootstrap.run(ProcessBootstrap.java:32)
at org.gradle.launcher.GradleMain.main(GradleMain.java:23)
Caused by: org.gradle.cache.CacheOpenException: Could not open no_buildscript class cache for build file 'D:\gradle-play
ground\hello-world\build.gradle' (\\omafp01.corp.planetci.com\ramc01\.gradle\caches\1.11\scripts\build_5trnq1oe4m84o6rmg
gev8gku4t\ProjectScript\no_buildscript).
at org.gradle.cache.internal.DefaultPersistentDirectoryStore.open(DefaultPersistentDirectoryStore.java:48)
at org.gradle.cache.internal.DefaultPersistentDirectoryStore.open(DefaultPersistentDirectoryStore.java:28)
at org.gradle.cache.internal.DefaultCacheFactory.doOpen(DefaultCacheFactory.java:81)
at org.gradle.cache.internal.DefaultCacheFactory.open(DefaultCacheFactory.java:51)
at org.gradle.cache.internal.DefaultCacheRepository$PersistentCacheBuilder.doOpen(DefaultCacheRepository.java:14
1)
at org.gradle.cache.internal.DefaultCacheRepository$AbstractCacheBuilder.open(DefaultCacheRepository.java:124)
at org.gradle.groovy.scripts.internal.FileCacheBackedScriptClassCompiler.compile(FileCacheBackedScriptClassCompi
ler.java:57)
at org.gradle.groovy.scripts.internal.ShortCircuitEmptyScriptCompiler.compile(ShortCircuitEmptyScriptCompiler.ja
va:35)
at org.gradle.groovy.scripts.internal.CachingScriptClassCompiler.compile(CachingScriptClassCompiler.java:36)
at org.gradle.groovy.scripts.DefaultScriptCompilerFactory$ScriptCompilerImpl.compile(DefaultScriptCompilerFactor
y.java:57)
at org.gradle.configuration.DefaultScriptPluginFactory$ScriptPluginImpl.apply(DefaultScriptPluginFactory.java:17
1)
at org.gradle.configuration.project.BuildScriptProcessor.execute(BuildScriptProcessor.java:38)
at org.gradle.configuration.project.BuildScriptProcessor.execute(BuildScriptProcessor.java:25)
at org.gradle.configuration.project.ConfigureActionsProjectEvaluator.evaluate(ConfigureActionsProjectEvaluator.j
ava:34)
at org.gradle.configuration.project.LifecycleProjectEvaluator.evaluate(LifecycleProjectEvaluator.java:55)
... 25 more
Caused by: java.nio.channels.OverlappingFileLockException
at org.gradle.cache.internal.filelock.LockStateAccess.tryLock(LockStateAccess.java:83)
at org.gradle.cache.internal.filelock.LockFileAccess.tryLockState(LockFileAccess.java:83)
at org.gradle.cache.internal.DefaultFileLockManager$DefaultFileLock.lockStateRegion(DefaultFileLockManager.java:
312)
at org.gradle.cache.internal.DefaultFileLockManager$DefaultFileLock.lock(DefaultFileLockManager.java:255)
at org.gradle.cache.internal.DefaultFileLockManager$DefaultFileLock.<init>(DefaultFileLockManager.java:127)
at org.gradle.cache.internal.DefaultFileLockManager.lock(DefaultFileLockManager.java:80)
at org.gradle.cache.internal.DefaultFileLockManager.lock(DefaultFileLockManager.java:67)
at org.gradle.cache.internal.DefaultCacheAccess.open(DefaultCacheAccess.java:86)
at org.gradle.cache.internal.DefaultPersistentDirectoryStore.open(DefaultPersistentDirectoryStore.java:46)
... 39 more
Here are the contents of build.gradle:
task hello {
doLast {
println 'Hello world!'
}
}
I am running Windows 8, a 64-bit JDK (1.6_043), and Gradle 1.11 while connected to a VPN. Of course, this works fine on my Macbook, but I need to get it working on my work machine.
It appears this was a problem writing to my default cache directory, which exists on a network location. To fix this, I added a GRADLE_USER_HOME environment variable, pointing to a local drive instead: C:\Users\ramc01\.gradle. Fixed!

Resources